{"text_format":"1","workbook":"xlsx","n_sheets":4,"sheets":["GUIDE","13b-1 Annual Accounts","13b-2 Annual Disb. Request","13b-3 Final Accounts"],"not_rendered":{"charts":0,"images":0,"macros":1,"external_links":0,"defined_names":3,"comments":0,"pivot_tables":0},"unopened":[],"bounds":{"document_bytes":16777216,"sheet_cells":100000,"rows_first":2000,"rows_last":500,"rows_between":2000,"halvings":0,"cell_chars":16384,"cell_head_chars":4096},"cells_cut":0,"cells_raw":0,"read":"whole","date_system":"1900"}

{"sheet":"GUIDE","index":0,"n_rows":53,"n_cols":6,"rows_kept":53,"cut":false,"hidden":false,"merged":[[26,1,27,1],[30,1,31,1],[12,2,12,5],[11,1,13,1],[14,1,16,1],[3,1,6,5],[9,1,9,5],[16,2,16,5],[21,1,23,1],[15,2,15,5],[11,2,11,5],[13,2,13,5],[14,2,14,5]]}
[null,"FRAMEWORK PROGRAMMES"]
[]
[null,"INTRO"]
[null,"This template 13b, in accordance with the SSC Guidelines for the financial calendar year for Framework Programmes, serves as a common instrument for the Danish Authority to:\n  1) report to MYNSEK on grants, annual budgets and budget revisions\n  2) report and forecast to MYNSEK annual and final accounts and cash flow movements\n  3) submit to MYNSEK annual and final disbursement requests"]
[]
[]
[]
[]
[null,"FINANCIAL CALENDAR YEAR"]
[null,"The financial calendar covers 01 January - 31 December and consists of two consultations with the following standard activities and deadlines:"]
[null,"Hearing & Submisson dates","Activity"]
[null,"February - 31 March latest submission date","- The Danish Authority's submission of its realised (audited) annual framework programme expenditure of the preceding financial calendar year"]
[null,null,"- The Danish Authority's submission of the framework programme budget for the financial calendar year"]
[null,null,"- The Danish Authority's submission of its disbursement (funding) request in accordance with the MYNSEK-approved budget for the financial calendar year"]
[null,"September - 30 September latest submission date","- The Danish Authority's submission of its full-year framework programme expenditure forecast for the financial calendar year"]
[null,null,"- The Danish Authority's submission of a (if applicable) revised framework programme budget for the financial calendar year"]
[null,null,"- The Danish Authority's submission of its disbursement or repayment (funding) request in accordance with the full-year expenditure forecast for the financial calendar year"]
[]
[]
[null,"GUIDE TO TEMPLATE USAGE"]
[null,"General comments","Sheet","Consultation","Cells","Objective"]
[null,"It is allowed to add rows within sheet \"REPORTING\".\n\nIt is not allowed to add columms within sheet \"REPORTING\"","13b-1 Annual Accounts","February","C6:C9","MYNSEK master data"]
[null,null,"13b-1 Annual Accounts","February","C10:C11","Danish Authority master data"]
[null,null,"13b-1 Annual Accounts","February","C12:C14","Project period and Financial Calendar reporting year"]
[null,null,"13b-1 Annual Accounts","February","B21:B41","Approved projects & phases + cross-cutting activities"]
[null,null,"13b-1 Annual Accounts","February","D21:D41","Approved original grant amount"]
[null,"All cells marked in blue in sheets \"REPORTING\" and \"DISB\" must be filled out by the Danish Authority","13b-1 Annual Accounts","February","E21:H41","Annually approved grant variation amounts"]
[null,null,"13b-1 Annual Accounts","February","K21:K41","Reported annual accounts from the preceding financial calendar year"]
[null,null,"13b-1 Annual Accounts","February","L21:L41","Total reported annual accounts from the preceding financial calendar years"]
[null,null,"13b-1 Annual Accounts","February","M21:M41","Proposed budget for the financial calendar year"]
[null,"All cells marked in grey in sheets \"REPORTING\" and \"DISB\" contain formulas and may not be altered","13b-1 Annual Accounts","February","N21:P41","Proposed budget for the subsequent financial calendar years (rounded/approximate figures only)"]
[null,null,"13b-1 Annual Accounts","February","C62:F63","Total annual funds received or returned by the Danish Authority within the Framework Programme"]
[null,null,"13b-1 Annual Accounts","February","B73:D105","Management declaration, dating and signature"]
[]
[null,null,"13b-1 Annual Accounts","September","W21:W41","Forecasted expenditure for the months of January - August of the financial calendar year"]
[null,null,"13b-1 Annual Accounts","September","X21:X41","Forecasted expenditure for the months of September - December of the financial calendar year"]
[null,null,"13b-1 Annual Accounts","September","C63:F64","Total annual funds received or returned by the Danish Authority within the Framework Programme"]
[null,null,"13b-1 Annual Accounts","September","B73:D105","Management declaration, dating and signature"]
[]
[]
[null,null,"13b-2 Annual Disb. Request","February & September","C10:C16","Danish Authority contact information"]
[null,null,"13b-2 Annual Disb. Request","February & September","C23","Drop-down menu - choose the applicable consultation"]
[null,null,"13b-2 Annual Disb. Request","February & September","C31:C37","Danish Authority bank information"]
[null,null,"13b-2 Annual Disb. Request","February & September","B41:G66","Management declaration, dating and signature"]
[]
[]
[null,null,"13b-3 Final Accounts","February (Final Reporting Year)","B23:B41","Approved projects & phases + cross-cutting activities"]
[null,null,"13b-3 Final Accounts","February (Final Reporting Year)","D23:D41","Approved original grant amount"]
[null,null,"13b-3 Final Accounts","February (Final Reporting Year)","E23:H41","Annually approved grant variation amounts"]
[null,null,"13b-3 Final Accounts","February (Final Reporting Year)","K23:K41","Reported annual accounts from the preceding financial calendar year"]
[null,null,"13b-3 Final Accounts","February (Final Reporting Year)","L23:L41","Reported total accounts from all preceding financial calendar years"]
[null,null,"13b-3 Final Accounts","February (Final Reporting Year)","C52:F53","Total annual funds received or returned by the Danish Authority within the Framework Programme"]
[null,null,"13b-3 Final Accounts","February (Final Reporting Year)","B62:D94","Management declaration, dating and signature"]

{"sheet":"13b-1 Annual Accounts","index":1,"n_rows":104,"n_cols":30,"rows_kept":104,"cut":false,"hidden":false,"merged":[[10,2,10,6],[11,2,11,6],[12,2,12,6],[13,2,13,6],[0,1,3,6],[5,2,5,6],[6,2,6,6],[7,2,7,6],[8,2,8,6],[9,2,9,6],[15,1,15,3],[34,1,34,2],[35,1,35,2],[36,1,36,2],[24,1,24,2],[30,1,30,2],[31,1,31,2],[32,1,32,2],[33,1,33,2],[22,1,22,2],[23,1,23,2],[27,1,27,2],[28,1,28,2],[29,1,29,2],[26,1,26,2],[25,1,25,2],[20,26,20,27],[20,1,21,2],[18,10,18,11],[20,17,20,18],[17,3,18,8],[17,10,17,20],[18,12,18,20],[20,19,20,20],[94,2,94,3],[103,2,103,3],[75,1,76,3],[72,1,74,3],[70,1,70,3],[80,2,80,3],[89,2,89,3],[57,1,57,2],[56,3,56,5],[68,1,68,2],[58,1,58,2],[67,1,67,2],[66,1,66,2],[65,1,65,2],[60,1,60,5],[65,3,65,5],[66,3,66,5],[67,3,67,5],[68,3,68,5],[58,3,58,5],[20,28,20,29],[17,22,17,29],[18,22,18,29],[57,3,57,5],[37,1,37,2],[43,1,43,8],[55,1,55,2],[38,1,38,2],[40,1,40,2],[47,1,47,3],[42,1,42,2],[39,1,39,2],[49,1,49,5],[54,3,54,5],[55,3,55,5],[56,1,56,2]]}
[null,"TEMPLATE 13b-1 - SSC FRAMEWORK PROGRAMME -\nANNUAL BUDGETS & ACCOUNTS"]
[]
[]
[]
[]
[null,"Framework Programme title:","Test"]
[null,"MYNSEK P360 File No.:","Test"]
[null,"MYNSEK Engagement No.:","Test"]
[null,"MYNSEK Job ID Nr.:","Test"]
[null,"Danish Authority Name:","Test"]
[null,"Danish Authority Framework Programme ID No.:","Test"]
[null,"Programme Start (YYYY):",2024]
[null,"Programme End (YYYY):",2027]
[null,"Finance Year (YYYY):",2026]
[]
[null,"1. BUDGET & ACCOUNTS REPORTING"]
[]
[null,null,null,{"$f":"\"TOTAL GRANT\n\"&$C$12&\" - \"&$C$13&\"\"","v":"TOTAL GRANT\n2024 - 2027"},null,null,null,null,null,null,{"$f":"\"FEBRUARY \"&$C$14&\" CONSULTATION\"","v":"FEBRUARY 2026 CONSULTATION"},null,null,null,null,null,null,null,null,null,null,null,{"$f":"\"SEPTEMBER \"&$C$14&\" CONSULTATION\"","v":"SEPTEMBER 2026 CONSULTATION"}]
[null,null,null,null,null,null,null,null,null,null,"ACCOUNTS",null,{"$f":"\"BUDGETS AND BALANCES\"","v":"BUDGETS AND BALANCES"},null,null,null,null,null,null,null,null,null,{"$f":"\"ACCOUNTS AND BALANCES\"","v":"ACCOUNTS AND BALANCES"}]
[]
[null,"Country & phase",null,{"$f":"\"TOTAL GRANT APPROVED\n\n\"&$C$12&\" - \"&$C$13&\"\"","v":"TOTAL GRANT APPROVED\n\n2024 - 2027"},{"$f":"\"TOTAL GRANT VARIATION \n+/-\n\"&$C$12&\"\"","v":"TOTAL GRANT VARIATION \n+/-\n2024"},{"$f":"\"TOTAL GRANT VARIATION \n+/-\n\"&$C$12+1&\"\"","v":"TOTAL GRANT VARIATION \n+/-\n2025"},{"$f":"\"TOTAL GRANT VARIATION \n+/-\n\"&$C$12+2&\"\"","v":"TOTAL GRANT VARIATION \n+/-\n2026"},{"$f":"\"TOTAL GRANT VARIATION \n+/-\n\"&$C$12+3&\"\"","v":"TOTAL GRANT VARIATION \n+/-\n2027"},{"$f":"\"TOTAL GRANT REVISED\"","v":"TOTAL GRANT REVISED"},null,{"$f":"_xlfn.IFS($C$14=$C$12,\"Reported Annual Accounts \n\nNOT APPLICABLE\",($C$14-1)>$C$12<($C$14+2),\"Reported Annual Accounts\n\n\"&$C$12&\"\",($C$14)>$C$12,\"Reported Annual Accounts\n\n\"&$C$14-1&\"\")","v":"Reported Annual Accounts\n\n2025"},{"$f":"_xlfn.IFS($C$14=$C$12,\"Total Reported Accounts to Date\n\nNOT APPLICABLE\",($C$14-1)>$C$12<($C$14+2),\"Total Reported Accounts to Date\n\n\"&$C$12&\"\",($C$14)>$C$12,\"Total Reported Accounts to Date\n\n\"&$C$12&\" -\"&$C$14-1&\"\")","v":"Total Reported Accounts to Date\n\n2024 -2025"},{"$f":"\"BUDGET\n\n\"&$C$14&\"\"","v":"BUDGET\n\n2026"},{"$f":"_xlfn.IFS($C$14-($C$12+1)>0,\"N/A\",$C$14-($C$12+1)=0,\"N/A\",$C$14-($C$12+1)<0,\"Expected Budget\n\n\"&$C$12+1&\"\")","v":"N/A"},{"$f":"_xlfn.IFS($C$14-($C$12+2)>0,\"N/A\",$C$14-($C$12+2)=0,\"N/A\",$C$14-($C$12+2)<0,\"Expected Budget\n\n\"&$C$12+2&\"\")","v":"N/A"},{"$f":"_xlfn.IFS($C$14-($C$12+3)>0,\"N/A\",$C$14-($C$12+3)=0,\"N/A\",$C$14-($C$12+3)<0,\"Expected Budget\n\n\"&$C$12+3&\"\")","v":"Expected Budget\n\n2027"},{"$f":"\"Estimated\naccumulated\nAccounts\nby end of \"&$C$14&\"\"","v":"Estimated\naccumulated\nAccounts\nby end of 2026"},{"$f":"\"Estimated\naccumulated\nBalance\nby end of  \"&$C$14&\"\"","v":"Estimated\naccumulated\nBalance\nby end of  2026"},null,{"$f":"\"Estimated\naccumulated\nBalance\nby end of the project period\"","v":"Estimated\naccumulated\nBalance\nby end of the project period"},null,null,{"$f":"\"Accounts Forecasted\nJan - Aug \"&$C$14&\"\"","v":"Accounts Forecasted\nJan - Aug 2026"},{"$f":"\"Accounts Forecast\nSep - Dec \"&C14&\"\"","v":"Accounts Forecast\nSep - Dec 2026"},{"$f":"\"Deviation from February \"&$C$14&\" budget\"","v":"Deviation from February 2026 budget"},{"$f":"\"Estimated accumulated\nAccounts\nby end of \"&$C$14&\"\"","v":"Estimated accumulated\nAccounts\nby end of 2026"},{"$f":"\"Estimated accumulated\nBalance\nby end of  \"&$C$14&\"\"","v":"Estimated accumulated\nBalance\nby end of  2026"},null,{"$f":"\"Estimated accumulated\nBalance\nby end of the project period\"","v":"Estimated accumulated\nBalance\nby end of the project period"}]
[null,null,null,"DKK","DKK","DKK","DKK","DKK","DKK",null,null,"DKK","DKK",{"$f":"IF(N21=\"N/A\",\"N/A\",\"DKK\")","v":"N/A"},{"$f":"IF(O21=\"N/A\",\"N/A\",\"DKK\")","v":"N/A"},{"$f":"IF(P21=\"N/A\",\"N/A\",\"DKK\")","v":"DKK"},"DKK","DKK","%","DKK","%",null,"DKK","DKK","DKK","DKK","DKK","%","DKK","%"]
[null,"Country 1, Phase 1",null,null,null,null,null,null,{"$f":"D23+E23+F23+G23+H23","v":0},null,null,null,null,null,null,null,{"$f":"L23+M23","v":0},{"$f":"I23-(L23+M23)","v":0},{"$f":"(L23+M23)/I23","v":{"$error":"#DIV/0!"}},{"$f":"I23-(L23+M23+N23+O23+P23)","v":0},{"$f":"(L23+M23+N23+O23+P23)/I23","v":{"$error":"#DIV/0!"}},null,null,null,{"$f":"M23-W23-X23","v":0},{"$f":"+L23+W23+X23","v":0},{"$f":"I23-(L23+W23+X23)","v":0},{"$f":"(L23+W23+X23)/I23","v":{"$error":"#DIV/0!"}},{"$f":"I23-(L23+W23+X23+N23+O23+P23)","v":0},{"$f":"(L23+N23+O23+P23+W23+X23)/I23","v":{"$error":"#DIV/0!"}}]
[null,"Country 1, Phase 2",null,null,null,null,null,null,{"$f":"D24+E24+F24+G24+H24","v":0},null,null,null,null,null,null,null,{"$f":"L24+M24","v":0},{"$f":"I24-(L24+M24)","v":0},{"$f":"(L24+M24)/I24","v":{"$error":"#DIV/0!"}},{"$f":"I24-(L24+M24+N24+O24+P24)","v":0},{"$f":"(L24+M24+N24+O24+P24)/I24","v":{"$error":"#DIV/0!"}},null,null,null,{"$f":"M24-W24-X24","v":0},{"$f":"+L24+W24+X24","v":0},{"$f":"I24-(L24+W24+X24)","v":0},{"$f":"(L24+X24)/I24","v":{"$error":"#DIV/0!"}},{"$f":"I24-(L24+W24+X24+N24+O24+P24)","v":0},{"$error":"#DIV/0!"}]
[null,"Country 1, Phase 3",null,null,null,null,null,null,{"$f":"D25+E25+F25+G25+H25","v":0},null,null,null,null,null,null,null,{"$f":"L25+M25","v":0},{"$f":"I25-(L25+M25)","v":0},{"$error":"#DIV/0!"},{"$f":"I25-(L25+M25+N25+O25+P25)","v":0},{"$error":"#DIV/0!"},null,null,null,0,{"$f":"+L25+W25+X25","v":0},{"$f":"I25-(L25+W25+X25)","v":0},{"$error":"#DIV/0!"},{"$f":"I25-(L25+W25+X25+N25+O25+P25)","v":0},{"$error":"#DIV/0!"}]
[null,"Country 1, Phase 4",null,null,null,null,null,null,{"$f":"D26+E26+F26+G26+H26","v":0},null,null,null,null,null,null,null,{"$f":"L26+M26","v":0},{"$f":"I26-(L26+M26)","v":0},{"$error":"#DIV/0!"},{"$f":"I26-(L26+M26+N26+O26+P26)","v":0},{"$error":"#DIV/0!"},null,null,null,0,{"$f":"+L26+W26+X26","v":0},{"$f":"I26-(L26+W26+X26)","v":0},{"$error":"#DIV/0!"},{"$f":"I26-(L26+W26+X26+N26+O26+P26)","v":0},{"$error":"#DIV/0!"}]
[null,"Total Country 1",null,{"$f":"SUM($D$23:$D$26)","v":0},{"$f":"SUM($E$23:$E$26)","v":0},{"$f":"SUM($F$23:$F$26)","v":0},{"$f":"SUM($G$23:$G$26)","v":0},{"$f":"SUM($H$23:$H$26)","v":0},{"$f":"SUM($I$23:$I$26)","v":0},null,{"$f":"SUM(K23:K26)","v":0},{"$f":"SUM($L$23:$L$26)","v":0},{"$f":"SUM($M$23:$M$26)","v":0},{"$f":"SUM($N$23:$N$26)","v":0},{"$f":"SUM($O$23:$O$26)","v":0},{"$f":"SUM($P$23:$P$26)","v":0},{"$f":"SUM($Q$23:$Q$26)","v":0},{"$f":"SUM($R$23:$R$26)","v":0},{"$f":"(L27+M27)/I27","v":{"$error":"#DIV/0!"}},{"$f":"SUM($T$23:$T$26)","v":0},{"$f":"(L27+M27+N27+O27+P27)/I27","v":{"$error":"#DIV/0!"}},null,{"$f":"SUM($W$23:$W$26)","v":0},{"$f":"SUM($X$23:$X$26)","v":0},0,{"$f":"SUM($Z$23:$Z$26)","v":0},{"$f":"SUM($AA$23:$AA$26)","v":0},{"$error":"#DIV/0!"},{"$f":"SUM($R$23:$R$26)","v":0},{"$error":"#DIV/0!"}]
[null,"Country 2, Phase 2",null,null,null,null,null,null,{"$f":"D28+E28+F28+G28+H28","v":0},null,null,null,null,null,null,null,{"$f":"L28+M28","v":0},{"$f":"I28-(L28+M28)","v":0},{"$error":"#DIV/0!"},{"$f":"I28-(L28+M28+N28+O28+P28)","v":0},{"$error":"#DIV/0!"},null,null,null,0,{"$f":"+L28+W28+X28","v":0},{"$f":"I28-(L28+W28+X28)","v":0},{"$error":"#DIV/0!"},{"$f":"I28-(L28+W28+X28+N28+O28+P28)","v":0},{"$error":"#DIV/0!"}]
[null,"Country 2, Phase 3",null,null,null,null,null,null,{"$f":"D29+E29+F29+G29+H29","v":0},null,null,null,null,null,null,null,{"$f":"L29+M29","v":0},{"$f":"I29-(L29+M29)","v":0},{"$error":"#DIV/0!"},{"$f":"I29-(L29+M29+N29+O29+P29)","v":0},{"$error":"#DIV/0!"},null,null,null,0,{"$f":"+L29+W29+X29","v":0},{"$f":"I29-(L29+W29+X29)","v":0},{"$error":"#DIV/0!"},{"$f":"I29-(L29+W29+X29+N29+O29+P29)","v":0},{"$error":"#DIV/0!"}]
[null,"Total Country 2",null,{"$f":"SUM($D$28:$D$29)","v":0},{"$f":"SUM($E$28:$E$29)","v":0},{"$f":"SUM($F$28:$F$29)","v":0},{"$f":"SUM($G$28:$G$29)","v":0},{"$f":"SUM($H$28:$H$29)","v":0},{"$f":"SUM($I$28:$I$29)","v":0},null,{"$f":"SUM(K28:K29)","v":0},{"$f":"SUM($L$28:$L$29)","v":0},{"$f":"SUM($M$28:$M$29)","v":0},{"$f":"SUM($N$28:$N$29)","v":0},{"$f":"SUM($O$28:$O$29)","v":0},{"$f":"SUM($P$28:$P$29)","v":0},{"$f":"SUM($Q$28:$Q$29)","v":0},{"$f":"SUM($R$28:$R$29)","v":0},{"$f":"(L30+M30)/I30","v":{"$error":"#DIV/0!"}},{"$f":"SUM($T$28:$T$29)","v":0},{"$error":"#DIV/0!"},null,{"$f":"SUM($W$28:$W$29)","v":0},{"$f":"SUM($X$28:$X$29)","v":0},0,{"$f":"SUM($Z$28:$Z$29)","v":0},{"$f":"SUM($AA$28:$AA$29)","v":0},{"$error":"#DIV/0!"},{"$f":"SUM($R$28:$R$29)","v":0},{"$error":"#DIV/0!"}]
[null,"Country 3, Phase 1",null,null,null,null,null,null,{"$f":"D31+E31+F31+G31+H31","v":0},null,null,null,null,null,null,null,{"$f":"L31+M31","v":0},{"$f":"I31-(L31+M31)","v":0},{"$error":"#DIV/0!"},{"$f":"I31-(L31+M31+N31+O31+P31)","v":0},{"$error":"#DIV/0!"},null,null,null,0,{"$f":"+L31+W31+X31","v":0},{"$f":"I31-(L31+W31+X31)","v":0},{"$error":"#DIV/0!"},{"$f":"I31-(L31+W31+X31+N31+O31+P31)","v":0},{"$error":"#DIV/0!"}]
[null,"Country 3, Phase 2",null,null,null,null,null,null,{"$f":"D32+E32+F32+G32+H32","v":0},null,null,null,null,null,null,null,{"$f":"L32+M32","v":0},{"$f":"I32-(L32+M32)","v":0},{"$error":"#DIV/0!"},{"$f":"I32-(L32+M32+N32+O32+P32)","v":0},{"$error":"#DIV/0!"},null,null,null,0,{"$f":"+L32+W32+X32","v":0},{"$f":"I32-(L32+W32+X32)","v":0},{"$error":"#DIV/0!"},{"$f":"I32-(L32+W32+X32+N32+O32+P32)","v":0},{"$error":"#DIV/0!"}]
[null,"Country 3, Phase 3",null,null,null,null,null,null,{"$f":"D33+E33+F33+G33+H33","v":0},null,null,null,null,null,null,null,{"$f":"L33+M33","v":0},{"$f":"I33-(L33+M33)","v":0},{"$error":"#DIV/0!"},{"$f":"I33-(L33+M33+N33+O33+P33)","v":0},{"$error":"#DIV/0!"},null,null,null,0,{"$f":"+L33+W33+X33","v":0},{"$f":"I33-(L33+W33+X33)","v":0},{"$error":"#DIV/0!"},{"$f":"I33-(L33+W33+X33+N33+O33+P33)","v":0},{"$error":"#DIV/0!"}]
[null,"Total Country 3",null,{"$f":"SUM($D$31:$D$33)","v":0},{"$f":"SUM($E$31:$E$33)","v":0},{"$f":"SUM($F$31:$F$33)","v":0},{"$f":"SUM($G$31:$G$33)","v":0},{"$f":"SUM($H$31:$H$33)","v":0},{"$f":"SUM($I$31:$I$33)","v":0},null,{"$f":"SUM(K31:K33)","v":0},{"$f":"SUM($L$31:$L$33)","v":0},{"$f":"SUM($M$31:$M$33)","v":0},{"$f":"SUM($N$31:$N$33)","v":0},{"$f":"SUM($O$31:$O$33)","v":0},{"$f":"SUM($P$31:$P$33)","v":0},{"$f":"SUM($Q$31:$Q$33)","v":0},{"$f":"SUM($R$31:$R$33)","v":0},{"$error":"#DIV/0!"},{"$f":"SUM($T$31:$T$33)","v":0},{"$error":"#DIV/0!"},null,{"$f":"SUM($W$31:$W$33)","v":0},{"$f":"SUM($X$31:$X$33)","v":0},0,{"$f":"SUM($Z$31:$Z$33)","v":0},{"$f":"SUM($AA$31:$AA$33)","v":0},{"$error":"#DIV/0!"},{"$f":"SUM($R$31:$R$33)","v":0},{"$error":"#DIV/0!"}]
[null,"Country 4, Inception",null,null,null,null,null,null,{"$f":"D35+E35+F35+G35+H35","v":0},null,null,null,null,null,null,null,{"$f":"L35+M35","v":0},{"$f":"I35-(L35+M35)","v":0},{"$error":"#DIV/0!"},{"$f":"I35-(L35+M35+N35+O35+P35)","v":0},{"$error":"#DIV/0!"},null,null,null,0,{"$f":"+L35+W35+X35","v":0},{"$f":"I35-(L35+W35+X35)","v":0},{"$error":"#DIV/0!"},{"$f":"I35-(L35+W35+X35+N35+O35+P35)","v":0},{"$error":"#DIV/0!"}]
[null,"Country 4, Phase 1",null,null,null,null,null,null,{"$f":"D36+E36+F36+G36+H36","v":0},null,null,null,null,null,null,null,{"$f":"L36+M36","v":0},{"$f":"I36-(L36+M36)","v":0},{"$error":"#DIV/0!"},{"$f":"I36-(L36+M36+N36+O36+P36)","v":0},{"$error":"#DIV/0!"},null,null,null,0,{"$f":"+L36+W36+X36","v":0},{"$f":"I36-(L36+W36+X36)","v":0},{"$error":"#DIV/0!"},{"$f":"I36-(L36+W36+X36+N36+O36+P36)","v":0},{"$error":"#DIV/0!"}]
[null,"Total Country 4",null,{"$f":"SUM($D$35:$D$36)","v":0},{"$f":"SUM($E$35:$E$36)","v":0},{"$f":"SUM($F$35:$F$36)","v":0},{"$f":"SUM($G$35:$G$36)","v":0},{"$f":"SUM($H$35:$H$36)","v":0},{"$f":"SUM($I$35:$I$36)","v":0},null,{"$f":"SUM(K35:K36)","v":0},{"$f":"SUM($L$35:$L$36)","v":0},{"$f":"SUM($M$35:$M$36)","v":0},{"$f":"SUM($N$35:$N$36)","v":0},{"$f":"SUM($O$35:$O$36)","v":0},{"$f":"SUM($P$35:$P$36)","v":0},{"$f":"SUM($Q$35:$Q$36)","v":0},{"$f":"SUM($R$35:$R$36)","v":0},{"$error":"#DIV/0!"},{"$f":"SUM($T$35:$T$36)","v":0},{"$error":"#DIV/0!"},null,{"$f":"SUM($W$35:$W$36)","v":0},{"$f":"SUM($X$35:$X$36)","v":0},0,{"$f":"SUM($Z$35:$Z$36)","v":0},{"$f":"SUM($AA$35:$AA$36)","v":0},{"$error":"#DIV/0!"},{"$f":"SUM($R$35:$R$36)","v":0},{"$error":"#DIV/0!"}]
[null,"Cross-cutting framework programme costs",null,null,null,null,null,null,null,null,null,null,null,null,null,null,null,null,null,null,null,null,null,null,0]
[null,"Results Monitoring and Learning",null,null,null,null,null,null,{"$f":"D39+E39+F39+G39+H39","v":0},null,null,null,null,null,null,null,{"$f":"L39+M39","v":0},{"$f":"I39-(L39+M39)","v":0},{"$f":"(L39+M39)/I39","v":{"$error":"#DIV/0!"}},{"$f":"I39-(L39+M39+N39+O39+P39)","v":0},{"$f":"(L39+M39+N39+O39+P39)/I39","v":{"$error":"#DIV/0!"}},null,null,null,0,{"$f":"+L39+W39+X39","v":0},{"$f":"I39-(L39+W39+X39)","v":0},{"$f":"(L39+X39)/I39","v":{"$error":"#DIV/0!"}},{"$f":"I39-(L39+W39+X39+N39+O39+P39)","v":0},{"$f":"(L39+N39+O39+P39+W39+X39)/I39","v":{"$error":"#DIV/0!"}}]
[null,"Public Diplomacy and Communication",null,null,null,null,null,null,{"$f":"D40+E40+F40+G40+H40","v":0},null,null,null,null,null,null,null,{"$f":"L40+M40","v":0},{"$f":"I40-(L40+M40)","v":0},{"$f":"(L40+M40)/I40","v":{"$error":"#DIV/0!"}},{"$f":"I40-(L40+M40+N40+O40+P40)","v":0},{"$f":"(L40+M40+N40+O40+P40)/I40","v":{"$error":"#DIV/0!"}},null,null,null,0,{"$f":"+L40+W40+X40","v":0},{"$f":"I40-(L40+W40+X40)","v":0},{"$f":"(L40+X40)/I40","v":{"$error":"#DIV/0!"}},{"$f":"I40-(L40+W40+X40+N40+O40+P40)","v":0},{"$f":"(L40+N40+O40+P40+W40+X40)/I40","v":{"$error":"#DIV/0!"}}]
[null,"Mid-Term Review",null,null,null,null,null,null,{"$f":"D41+E41+F41+G41+H41","v":0},null,null,null,null,null,null,null,{"$f":"L41+M41","v":0},{"$f":"I41-(L41+M41)","v":0},{"$f":"(L41+M41)/I41","v":{"$error":"#DIV/0!"}},{"$f":"I41-(L41+M41+N41+O41+P41)","v":0},{"$f":"(L41+M41+N41+O41+P41)/I41","v":{"$error":"#DIV/0!"}},null,null,null,0,{"$f":"+L41+W41+X41","v":0},{"$f":"I41-(L41+W41+X41)","v":0},{"$f":"(L41+X41)/I41","v":{"$error":"#DIV/0!"}},{"$f":"I41-(L41+W41+X41+N41+O41+P41)","v":0},{"$f":"(L41+N41+O41+P41+W41+X41)/I41","v":{"$error":"#DIV/0!"}}]
[]
[null,"Unallocated *",null,null,null,0,0,0,{"$f":"D43+E43+F43+G43+H43","v":0}]
[null,"* No expenditure can be charged to unallocated. Upon approval unallocated funds will be moved to a project or a cross cutting item."]
[]
[null,"GRAND TOTAL",null,{"$f":"+$D$27+$D$30+$D$34+$D$37+$D$39+$D$40+$D$41+$D$43","v":0},{"$f":"+$E$27+$E$30+$E$34+$E$37+$E$39+$E$40+$E$41+$E$43","v":0},{"$f":"+$F$27+$F$30+$F$34+$F$37+$F$39+$F$40+$F$41+$F$43","v":0},{"$f":"+$G$27+$G$30+$G$34+$G$37+$G$39+$G$40+$G$41+$G$43","v":0},{"$f":"+$H$27+$H$30+$H$34+$H$37+$H$39+$H$40+$H$41+$H$43","v":0},{"$f":"+$I$27+$I$30+$I$34+$I$37+$I$39+$I$40+$I$41+$I$43","v":0},null,{"$f":"+$K$27+$K$30+$K$34+$K$37+$K$39+$K$40+$K$41","v":0},{"$f":"+$L$27+$L$30+$L$34+$L$37+$L$39+$L$40+$L$41","v":0},{"$f":"+$M$27+$M$30+$M$34+$M$37+$M$39+$M$40+$M$41","v":0},{"$f":"+$N$27+$N$30+$N$34+$N$37+$N$39+$N$40+$N$41","v":0},{"$f":"+$O$27+$O$30+$O$34+$O$37+$O$39+$O$40+$O$41","v":0},{"$f":"+$P$27+$P$30+$P$34+$P$37+$P$39+$P$40+$P$41","v":0},{"$f":"+$Q$27+$Q$30+$Q$34+$Q$37+$Q$39+$Q$40+$Q$41","v":0},{"$f":"+$R$27+$R$30+$R$34+$R$37+$R$39+$R$40+$R$41","v":0},{"$f":"(L46+M46)/I46","v":{"$error":"#DIV/0!"}},{"$f":"+$T$27+$T$30+$T$34+$T$37+$T$39+$T$40+$T$41","v":0},{"$f":"(L46+M46+N46+O46+P46)/I46","v":{"$error":"#DIV/0!"}},null,{"$f":"+$W$27+$W$30+$W$34+$W$37+$W$39+$W$40+$W$41","v":0},{"$f":"+$X$27+$X$30+$X$34+$X$37+$X$39+$X$40+$X$41","v":0},{"$f":"M46-W46-X46","v":0},{"$f":"+$Z$27+$Z$30+$Z$34+$Z$37+$Z$39+$Z$40+$Z$41","v":0},{"$f":"+$AA$27+$AA$30+$AA$34+$AA$37+$AA$39+$AA$40+$AA$41","v":0},{"$f":"(L46+X46)/I46","v":{"$error":"#DIV/0!"}},{"$f":"+$AC$27+$AC$30+$AC$34+$AC$37+$AC$39+$AC$40+$AC$41","v":0},{"$f":"(L46+N46+O46+P46+W46+X46)/I46","v":{"$error":"#DIV/0!"}}]
[]
[null,"2. FUNDING POSITION"]
[]
[null,{"$f":"\"FEBRUARY \"&$C$14&\" CONSULTATION\"","v":"FEBRUARY 2026 CONSULTATION"}]
[null,"Calendar Year",{"$f":"$C$12","v":2024},{"$f":"$C$51+1","v":2025},{"$f":"$D$51+1","v":2026},{"$f":"$E$51+1","v":2027}]
[null,"Payment received",0,0,0,0]
[null,"Payment returned",0,0,0,0]
[null,"Net Balance",{"$f":"$C$52-$C$53","v":0},{"$f":"$D$52-$D$53","v":0},{"$f":"$E$52-$E$53","v":0},{"$f":"$F$52-$F$53","v":0}]
[null,{"$f":"\"Total net funding as of 31 December \"&$C$14-1&\"\"","v":"Total net funding as of 31 December 2025"},null,{"$f":"SUM($C$54:$F$54)","v":0}]
[null,{"$f":"\"Total reported Accounts as of 31 December \"&$C$14-1&\"\"","v":"Total reported Accounts as of 31 December 2025"},null,{"$f":"$L$46","v":0}]
[null,{"$f":"\"Total funding carried forward as of 31 December \"&$C$14-1&\"\"","v":"Total funding carried forward as of 31 December 2025"},null,{"$f":"+$D$55-$D$56","v":0}]
[null,{"$f":"\"Forecast - financial calendar \"&$C$14&\"\"","v":"Forecast - financial calendar 2026"},null,{"$f":"$M$46","v":0}]
[null,{"$f":"\"Estimated Funding need - financial calendar year \"&$C$14&\"\"","v":"Estimated Funding need - financial calendar year 2026"},null,{"$f":"+$D$56-$D$55+$D$58","v":0}]
[]
[null,{"$f":"\"SEPTEMBER \"&$C$14&\" CONSULTATION\"","v":"SEPTEMBER 2026 CONSULTATION"}]
[null,"Calendar Year",{"$f":"$C$12","v":2024},{"$f":"$C$51+1","v":2025},{"$f":"$D$51+1","v":2026},{"$f":"$E$51+1","v":2027}]
[null,"Payment received",0,0,0,0]
[null,"Payment returned",0,0,0,0]
[null,"Net Funding Balance",{"$f":"$C$63-$C$64","v":0},{"$f":"$D$63-$D$64","v":0},{"$f":"$E$63-$E$64","v":0},{"$f":"$F$63-$F$64","v":0}]
[null,{"$f":"\"Total net funding prior to September \"&$C$14&\" hearing\"","v":"Total net funding prior to September 2026 hearing"},null,{"$f":"SUM($C$65:$F$65)","v":0}]
[null,{"$f":"\"Total reported accounts as of 31 December \"&$C$14-1&\"\"","v":"Total reported accounts as of 31 December 2025"},null,{"$f":"SUM($L$46:$L$46)","v":0}]
[null,{"$f":"\"Forecast - financial calendar \"&$C$14&\"\"","v":"Forecast - financial calendar 2026"},null,{"$f":"SUM($W$46:$X$46)","v":0}]
[null,{"$f":"\"Estimated Funding need - financial calendar year \"&$C$14&\"\"","v":"Estimated Funding need - financial calendar year 2026"},null,{"$f":"+$D$67-$D$66+$D$68","v":0}]
[]
[null,"3. SIGNATURE"]
[null,"Management declaration: "]
[null," [Insert declaration according to section 6.6, SSC Guidelines]"]
[]
[]
[null,"Furthermore, we hereby declare that the requirements stated in the SSC Guidelines Chapter 6.3 have been followed"]
[]
[]
[null,"For Danish Authority Management"]
[]
[null,"Name (block letters):"]
[]
[]
[null,"Signature:"]
[]
[]
[]
[]
[]
[null,"Date (DD-MM-YYYY):"]
[]
[]
[null,"For Finance Officer"]
[]
[null,"Name (block letters):"]
[]
[]
[null,"Signature:"]
[]
[]
[]
[]
[]
[null,"Date (DD-MM-YYYY):"]

{"sheet":"13b-2 Annual Disb. Request","index":2,"n_rows":70,"n_cols":3,"rows_kept":70,"cut":false,"hidden":false,"merged":[[12,2,12,6],[31,2,31,5],[32,2,32,5],[33,2,33,5],[34,2,34,5],[22,2,22,5],[13,2,13,6],[14,2,14,6],[0,1,1,6],[6,2,6,6],[11,2,11,6],[4,2,4,6],[5,2,5,6],[3,2,3,6],[9,2,9,6],[10,2,10,6],[7,2,7,6],[50,2,50,4],[55,2,55,4],[64,2,64,4],[53,1,53,6],[15,2,15,6],[28,1,28,5],[29,2,29,5],[30,2,30,5],[41,2,41,4],[39,1,39,5],[24,2,24,5],[16,2,16,6],[17,2,17,6],[19,2,19,6],[35,2,35,5],[36,2,36,5]]}
[null,"TEMPLATE 13b-2 - SSC FRAMEWORK PROGRAMME - DISBURSEMENT REQUEST"]
[]
[]
[null,"Framework programme title:",{"$f":"'13b-1 Annual Accounts'!$C$6","v":"Test"}]
[null,"MYNSEK P360 File No.:",{"$f":"'13b-1 Annual Accounts'!$C$7","v":"Test"}]
[null,"MYNSEK Engagement No.:",{"$f":"'13b-1 Annual Accounts'!$C$8","v":"Test"}]
[null,"MYNSEK Job ID Nr.:",{"$f":"'13b-1 Annual Accounts'!$C$9","v":"Test"}]
[null,"Danish Authority Name:",{"$f":"'13b-1 Annual Accounts'!$C$10","v":"Test"}]
[null,"Danish Authority Address"]
[null,"Street:"]
[null,"Postal Code & City:"]
[null,"Danish Authority contact information"]
[null,"Contact person name:"]
[null,"Contact person email:"]
[null,"Phone:"]
[null,"Email:"]
[null,"Danish Authority Framework Programme ID No.:",{"$f":"'13b-1 Annual Accounts'!$C$11","v":"Test"}]
[null,"Framework Programme Start (YYYY):",{"$f":"'13b-1 Annual Accounts'!$C$12","v":2024}]
[null,"Framework Programme End (YYYY):",{"$f":"'13b-1 Annual Accounts'!$C$13","v":2027}]
[null,"Finance Year (YYYY):",{"$f":"'13b-1 Annual Accounts'!$C$14","v":2026}]
[]
[]
[null,"Consultation reference (MM-YYYY)","FEBRUARY 2025 CONSULTATION"]
[]
[null,"Requested disbursement amount:",{"$f":"_xlfn.IFS($C$23='13b-1 Annual Accounts'!$B$50,'13b-1 Annual Accounts'!$D$59,$C$23='13b-1 Annual Accounts'!$B$61,'13b-1 Annual Accounts'!$D$69,$C$23='13b-1 Annual Accounts'!#REF!,'13b-1 Annual Accounts'!#REF!)","v":{"$error":"#REF!"}}]
[]
[]
[]
[null,"Danish Authority Bank Information"]
[null,"Payment type:","Bank transfer"]
[null,"Currency code:"]
[null,"Bank name:"]
[null,"Bank address:"]
[null,"Account name:"]
[null,"Account number:"]
[null,"SWIFT:"]
[null,"IBAN:"]
[]
[]
[null,"For Danish Authority Management"]
[]
[null,"Name (block letters):"]
[]
[]
[null,"Signature:"]
[]
[]
[]
[]
[]
[null,"Date:"]
[]
[]
[null,"For Finance Officer"]
[]
[null,"Name (block letters):"]
[]
[]
[null,"Signature:"]
[]
[]
[]
[]
[]
[null,"Date:"]
[]
[]
[]
[null,{"$f":"'13b-1 Annual Accounts'!$B$50","v":"FEBRUARY 2026 CONSULTATION"}]
[null,{"$f":"'13b-1 Annual Accounts'!$B$61","v":"SEPTEMBER 2026 CONSULTATION"}]

{"sheet":"13b-3 Final Accounts","index":3,"n_rows":93,"n_cols":14,"rows_kept":93,"cut":false,"hidden":false,"merged":[[69,2,69,3],[78,2,78,3],[92,2,92,3],[83,2,83,3],[10,2,10,3],[11,2,11,3],[12,2,12,3],[13,2,13,3],[61,1,63,3],[58,1,58,3],[64,1,65,3],[33,1,33,2],[43,1,43,8],[47,1,47,3],[36,1,36,2],[37,1,37,2],[38,1,38,2],[39,1,39,2],[40,1,40,2],[42,1,42,2],[20,12,20,13],[22,1,22,2],[23,1,23,2],[17,10,17,13],[18,10,18,13],[31,1,31,2],[32,1,32,2],[34,1,34,2],[0,1,3,3],[5,2,5,3],[6,2,6,3],[7,2,7,3],[8,2,8,3],[49,1,49,5],[54,3,54,5],[55,3,55,5],[56,3,56,5],[9,2,9,3],[15,1,15,3],[17,3,18,8],[20,1,21,2],[35,1,35,2],[24,1,24,2],[25,1,25,2],[26,1,26,2],[27,1,27,2],[28,1,28,2],[29,1,29,2],[30,1,30,2]]}
[null,"TEMPLATE 13b-3 - SSC FRAMEWORK PROGRAMME -\nFINAL ACCOUNTS"]
[]
[]
[]
[]
[null,"Framework Programme title:",{"$f":"'13b-1 Annual Accounts'!$C$6","v":"Test"}]
[null,"MYNSEK P360 File No.:",{"$f":"'13b-1 Annual Accounts'!$C$7","v":"Test"}]
[null,"MYNSEK Engagement No.:",{"$f":"'13b-1 Annual Accounts'!$C$8","v":"Test"}]
[null,"MYNSEK Job ID Nr.:",{"$f":"'13b-1 Annual Accounts'!$C$9","v":"Test"}]
[null,"Danish Authority Name:",{"$f":"'13b-1 Annual Accounts'!$C$10","v":"Test"}]
[null,"Danish Authority Framework Programme ID No.:",{"$f":"'13b-1 Annual Accounts'!$C$11","v":"Test"}]
[null,"Programme Start (YYYY):",{"$f":"'13b-1 Annual Accounts'!$C$12","v":2024}]
[null,"Programme End (YYYY):",{"$f":"'13b-1 Annual Accounts'!$C$13","v":2027}]
[null,"Finance Year (YYYY):",{"$f":"$C$13","v":2027}]
[]
[null,"1. BUDGET & ACCOUNTS REPORTING"]
[]
[null,null,null,{"$f":"\"TOTAL GRANT\n\"&$C$12&\" - \"&$C$13&\"\"","v":"TOTAL GRANT\n2024 - 2027"},null,null,null,null,null,null,{"$f":"\"FEBRUARY \"&C13+1&\" CONSULTATION\"","v":"FEBRUARY 2028 CONSULTATION"}]
[null,null,null,null,null,null,null,null,null,null,{"$f":"\"FINAL ACCOUNTS\n\"&$C$12&\" - \"&$C$13&\"\"","v":"FINAL ACCOUNTS\n2024 - 2027"}]
[]
[null,"Country & Phase",null,{"$f":"\"TOTAL GRANT APPROVED\n\n\"&$C$12&\" - \"&$C$13&\"\"","v":"TOTAL GRANT APPROVED\n\n2024 - 2027"},{"$f":"\"TOTAL GRANT VARIATION \n+/-\n\"&$C$12&\"\"","v":"TOTAL GRANT VARIATION \n+/-\n2024"},{"$f":"\"TOTAL GRANT VARIATION \n+/-\n\"&$C$12+1&\"\"","v":"TOTAL GRANT VARIATION \n+/-\n2025"},{"$f":"\"TOTAL GRANT VARIATION \n+/-\n\"&$C$12+2&\"\"","v":"TOTAL GRANT VARIATION \n+/-\n2026"},{"$f":"\"TOTAL GRANT VARIATION \n+/-\n\"&$C$12+3&\"\"","v":"TOTAL GRANT VARIATION \n+/-\n2027"},{"$f":"\"TOTAL GRANT REVISED\"","v":"TOTAL GRANT REVISED"},null,{"$f":"\"Reported Accounts\n \"&$C$13&\"\"","v":"Reported Accounts\n 2027"},{"$f":"\"Total Reported Accounts\n \"&$C$12&\" - \"&$C$13&\"\"","v":"Total Reported Accounts\n 2024 - 2027"},{"$f":"\"Accumulated\nBalance\n\n\"&$C$12&\" - \"&$C$13&\"\"","v":"Accumulated\nBalance\n\n2024 - 2027"}]
[null,null,null,"DKK","DKK","DKK","DKK","DKK","DKK",null,"DKK",null,"DKK","%"]
[null,"Country 1, Inception",null,null,null,null,null,null,{"$f":"D23+E23+F23+G23+H23","v":0},null,null,null,{"$f":"I23-(L23)","v":0},{"$f":"(L23)/I23","v":{"$error":"#DIV/0!"}}]
[null,"Country 1, Phase 1",null,null,null,null,null,null,{"$f":"D24+E24+F24+G24+H24","v":0},null,null,null,{"$f":"I24-(L24)","v":0},{"$f":"(L24)/I24","v":{"$error":"#DIV/0!"}}]
[null,"Country 1, Phase 2",null,null,null,null,null,null,{"$f":"D25+E25+F25+G25+H25","v":0},null,null,null,{"$f":"I25-(L25)","v":0},{"$error":"#DIV/0!"}]
[null,"Country 1, Phase 3",null,null,null,null,null,null,{"$f":"D26+E26+F26+G26+H26","v":0},null,null,null,{"$f":"I26-(L26)","v":0},{"$error":"#DIV/0!"}]
[null,"Total Country 1",null,{"$f":"SUM($D$23:$D$26)","v":0},{"$f":"SUM($E$23:$E$26)","v":0},{"$f":"SUM($F$23:$F$26)","v":0},{"$f":"SUM($G$23:$G$26)","v":0},{"$f":"SUM($H$23:$H$26)","v":0},{"$f":"SUM($I$23:$I$26)","v":0},null,{"$f":"SUM($K$23:$K$26)","v":0},{"$f":"SUM(L23:L26)","v":0},{"$f":"SUM(M23:M26)","v":0},{"$error":"#DIV/0!"}]
[null,"Country 2, Phase 2",null,null,null,null,null,null,{"$f":"D28+E28+F28+G28+H28","v":0},null,null,null,{"$f":"I28-(L28)","v":0},{"$error":"#DIV/0!"}]
[null,"Country 2, Phase 3",null,null,null,null,null,null,{"$f":"D29+E29+F29+G29+H29","v":0},null,null,null,{"$f":"I29-(L29)","v":0},{"$error":"#DIV/0!"}]
[null,"Total Country 2",null,{"$f":"SUM($D$28:$D$29)","v":0},{"$f":"SUM($E$28:$E$29)","v":0},{"$f":"SUM($F$28:$F$29)","v":0},{"$f":"SUM($G$28:$G$29)","v":0},{"$f":"SUM($H$28:$H$29)","v":0},{"$f":"SUM($I$28:$I$29)","v":0},null,{"$f":"SUM($K$28:$K$29)","v":0},{"$f":"SUM(L28:L29)","v":0},{"$f":"SUM(M28:M29)","v":0},{"$error":"#DIV/0!"}]
[null,"Country 3, Phase 1",null,null,null,null,null,null,{"$f":"D31+E31+F31+G31+H31","v":0},null,null,null,{"$f":"I31-(L31)","v":0},{"$error":"#DIV/0!"}]
[null,"Country 3, Phase 2",null,null,null,null,null,null,{"$f":"D32+E32+F32+G32+H32","v":0},null,null,null,{"$f":"I32-(L32)","v":0},{"$error":"#DIV/0!"}]
[null,"Country 3, Phase 3",null,null,null,null,null,null,{"$f":"D33+E33+F33+G33+H33","v":0},null,null,null,{"$f":"I33-(L33)","v":0},{"$error":"#DIV/0!"}]
[null,"Total Country 3",null,{"$f":"SUM($D$31:$D$33)","v":0},{"$f":"SUM($E$31:$E$33)","v":0},{"$f":"SUM($F$31:$F$33)","v":0},{"$f":"SUM($G$31:$G$33)","v":0},{"$f":"SUM($H$31:$H$33)","v":0},{"$f":"SUM($I$31:$I$33)","v":0},null,{"$f":"SUM($K$31:$K$33)","v":0},{"$f":"SUM(L31:L33)","v":0},{"$f":"SUM(M31:M33)","v":0},{"$error":"#DIV/0!"}]
[null,"Country 4, Inception",null,null,null,null,null,null,{"$f":"D35+E35+F35+G35+H35","v":0},null,null,null,{"$f":"I35-(L35)","v":0},{"$error":"#DIV/0!"}]
[null,"Country 4, Phase 1",null,null,null,null,null,null,{"$f":"D36+E36+F36+G36+H36","v":0},null,null,null,{"$f":"I36-(L36)","v":0},{"$error":"#DIV/0!"}]
[null,"Total Country 4",null,{"$f":"SUM($D$35:$D$36)","v":0},{"$f":"SUM($E$35:$E$36)","v":0},{"$f":"SUM($F$35:$F$36)","v":0},{"$f":"SUM($G$35:$G$36)","v":0},{"$f":"SUM($H$35:$H$36)","v":0},{"$f":"SUM($I$35:$I$36)","v":0},null,{"$f":"SUM($K$35:$K$36)","v":0},{"$f":"SUM(L35:L36)","v":0},{"$f":"SUM(M35:M36)","v":0},{"$error":"#DIV/0!"}]
[null,"Cross-cutting framework programme costs"]
[null,"Results Monitoring and Learning",null,null,null,null,null,null,{"$f":"D39+E39+F39+G39+H39","v":0},null,null,null,{"$f":"I39-(L39)","v":0},{"$f":"(L39)/I39","v":{"$error":"#DIV/0!"}}]
[null,"Public Diplomacy and Communication",null,null,null,null,null,null,{"$f":"D40+E40+F40+G40+H40","v":0},null,null,null,{"$f":"I40-(L40)","v":0},{"$f":"(L40)/I40","v":{"$error":"#DIV/0!"}}]
[null,"Mid-Term Review",null,null,null,null,null,null,{"$f":"D41+E41+F41+G41+H41","v":0},null,null,null,{"$f":"I41-(L41)","v":0},{"$f":"(L41)/I41","v":{"$error":"#DIV/0!"}}]
[]
[null,"Unallocated *",null,null,null,0,0,0,{"$f":"D43+E43+F43+G43+H43","v":0}]
[null,"* No expenditure can be charged to unallocated. Upon approval unallocated funds will be moved to a project or a cross-cutting item."]
[]
[null,"GRAND TOTAL",null,{"$f":"+$D$27+$D$30+$D$34+$D$37+$D$39+$D$40+$D$41+$D$43","v":0},{"$f":"+$E$27+$E$30+$E$34+$E$37+$E$39+$E$40+$E$41+$E$43","v":0},{"$f":"+$F$27+$F$30+$F$34+$F$37+$F$39+$F$40+$F$41+$F$43","v":0},{"$f":"+$G$27+$G$30+$G$34+$G$37+$G$39+$G$40+$G$41+$G$43","v":0},{"$f":"+$H$27+$H$30+$H$34+$H$37+$H$39+$H$40+$H$41+$H$43","v":0},{"$f":"+$I$27+$I$30+$I$34+$I$37+$I$39+$I$40+$I$41+$I$43","v":0},null,{"$f":"+$K$27+$K$30+$K$34+$K$37+$K$39+$K$40+$K$41","v":0},{"$f":"+L27+L30+L34+L37+L39+L40+L41","v":0},{"$f":"+M27+M30+M34+M37+M39+M40+M41","v":0},{"$f":"(L46)/I46","v":{"$error":"#DIV/0!"}}]
[]
[null,"2. FUNDING POSITION"]
[]
[null,{"$f":"\"FEBRUARY \"&$C$13+1&\" CONSULTATION: FINAL ACCOUNTS \"&C12&\" - \"&C13&\"\"","v":"FEBRUARY 2028 CONSULTATION: FINAL ACCOUNTS 2024 - 2027"}]
[null,"Calendar Year",{"$f":"$C$12","v":2024},{"$f":"$C$51+1","v":2025},{"$f":"$D$51+1","v":2026},{"$f":"$E$51+1","v":2027}]
[null,"Payment received",0,0,0,0]
[null,"Payment returned",0,0,0,0]
[null,"Net Balance",{"$f":"$C$52-$C$53","v":0},{"$f":"$D$52-$D$53","v":0},{"$f":"$E$52-$E$53","v":0},{"$f":"$F$52-$F$53","v":0}]
[null,{"$f":"\"Total net funding as of 31 December \"&$C$13&\"\"","v":"Total net funding as of 31 December 2027"},null,{"$f":"SUM($C$54:$F$54)","v":0}]
[null,{"$f":"\"Total reported expenditure as of 31 December \"&$C$13&\"\"","v":"Total reported expenditure as of 31 December 2027"},null,{"$f":"$L$46","v":0}]
[null,{"$f":"\"Closing financial position as of 31 December \"&$C$13&\"\"","v":"Closing financial position as of 31 December 2027"},null,{"$f":"$D$56-$D$55","v":0}]
[]
[null,"3. SIGNATURE"]
[]
[null,"Management declaration: "]
[null," [Insert declaration according to section 6.6, SSC Guidelines]"]
[]
[]
[null,"Furthermore, we hereby declare that the requirements stated in the SSC Guidelines Chapter 6.3 have been followed"]
[]
[]
[null,"For Danish Authority Management"]
[]
[null,"Name (block letters):"]
[]
[]
[null,"Signature:"]
[]
[]
[]
[]
[]
[null,"Date (DD-MM-YYYY):"]
[]
[]
[null,"For Finance Officer"]
[]
[null,"Name (block letters):"]
[]
[]
[null,"Signature:"]
[]
[]
[]
[]
[]
[null,"Date (DD-MM-YYYY):"]